{"text_format":"1","workbook":"xlsx","n_sheets":13,"sheets":["Instructions","Input","Prod(2021 Fescue+Seed+Stubb...)","Prod(2021 Fesc-Clover Hay)","Est(2021 CS Pasture Estab)","Prod(2021 Alfalfa Baleage)","Prod(2021 Alfalfa Small Bal...)","Est(2021 Alfalfa Estab)","Est(2021 Corn Silage)","MDB","Machinery Cost","Output","Store"],"not_rendered":{"charts":0,"images":1,"macros":1,"external_links":2,"defined_names":143,"comments":2,"pivot_tables":0},"unopened":[],"bounds":{"document_bytes":16777216,"sheet_cells":100000,"rows_first":2000,"rows_last":500,"rows_between":2000,"halvings":0,"cell_chars":16384,"cell_head_chars":4096},"cells_cut":0,"cells_raw":0,"read":"whole","date_system":"1900"}

{"sheet":"Instructions","index":0,"n_rows":32,"n_cols":5,"rows_kept":32,"cut":false,"hidden":true,"merged":[]}
["Barter","See owned equipment"]
["Business overhead costs","Use these fields to estimate total overhead costs for the farm and then allocate the portion of the total to the enterprise as a percent. Overhead costs for the enterprise are then divided by planted acres for the budget report.\n\nThe FBG estimates total operating and ownership costs of the pickup based on the mileage input for all uses. It is important to specify the allocation for the enterprise as a percentage of total pickup use, not just farm use.","overhead"]
["Button controls","See help for specific button topics, such as, 'Clear Input'."]
["Clear input","This button erases all previously entered data in the input worksheet in preparation for entering a new set of data. A warning is issued prior to clearing the input. Input data can be retrieved with the 'Recall Data' button only if it has been saved and attached to output (a budget report) with the 'Budget Report' command.\n\nIf the objective is to make minor changes in an existing budget of the same crop, do not use 'Clear Input'. Rather, recall the previous budget with 'Recall Data', make the minor data changes in the input worksheet and give the budget a new description in the 'Crop description' field. Press 'Budget Report' to make new calculations and store a new budget based on the revised data. "]
["Combines","See owned equipment"]
["Copy budget","The Forage Budget Generator works like any Excel spreadsheet. To copy a budget report to a new file, select the area to be copied and use the Edit\\Copy\\Paste or Paste Special commands to place the report in a new worksheet or a new file."]
["Crop description","The crop description field is critical for identifying budgets to be saved in the generator and distinguishing between budgets of the same forage crop. The FBG will not allow a budget with the same crop description to be overwritten without warning. Use the crop description field as a note pad to identify specific characteristics of the crop. For example, 'High Yield' vs 'Low Yield', or 'Custom Rates' vs 'Operator Owned'.","description"]
["Custom hire","As noted, entries in this section will account for labor value and equipment costs for all custom hired activities. ","customhire1","customhire2"]
["Delete budget","Deleting a budget permamently erases all input and output with the same crop description (except for 'Typical budgets'). To delete a budget it must have been run and appear as a worksheet tab. Use normal Excel commands to delete a worksheet: Select the worksheet, right-click, click delete."]
["Export data","The Export data option can be used to transfer budgets between different FBG files.  Simply place a checkmark next to the budgets you wish to export and browse for a directory to place the files.  When finished, click 'Ok'.  The budgets will be stored as text files in a folder called 'FBG Files' in the location you specified.  To retrieve the files, use the Import data command (see Import data)."]
{"$rows_left_out":23}
{"sheet":"Input","index":1,"n_rows":207,"n_cols":32,"rows_kept":207,"cut":false,"hidden":false,"merged":[[31,1,31,5],[54,1,54,5],[206,0,206,7],[147,0,147,7],[110,0,110,7],[64,1,64,5],[131,0,131,7],[24,0,24,7],[1,0,1,7],[4,1,4,6],[13,0,13,7],[3,0,3,7]]}
[null,null,null,null,null,null,null,null,null,null,null,null,null,null,null,null,null,null,null,null,null,null,null,null,null,null,null,null,null,null,"Establishment=1"]
["FORAGE BUDGET INPUT",null,null,null,null,null,null,null,null,null,null,null,null,null,null,null,null,null,null,null,null,null,null,null,null,null,null,"A number signals hiding",null,null,"Production=2"]
["Enter data in white boxes. Use \"Tab\" key to navigate between boxes",null,null,null,null,null,null,"Version 11.7.16",null,null,null,null,null,null,null,null,null,null,null,null,null,null,null,null,null,null,null,null,null,null,"Hide always=3"]
["Crop identification",null,null,null,null,null,null,null,null,null,null,null,null,null,null,null,null,null,null,null,null,null,null,null,null,null,"Hay","Haylage","Pasture","Seed","Establishment","Irr"]
["Crop description","2021 Fescue+Seed+Stubble Prod"]
["Is this an establishment year?"]
["Harvest as:","Yield unit"]
[]
[]
[]
{"$rows_left_out":198}
{"sheet":"Prod(2021 Fescue+Seed+Stubb...)","index":2,"n_rows":1337,"n_cols":7,"rows_kept":1337,"cut":false,"hidden":true,"merged":[]}
["Typical",null,null,null,"2020-10-26",null,""]
[]
["2021 Fescue+Seed+Stubble Prod",null,null,"Yield, tons air-dry:",3.2124999999999999]
["Production",null,null,"Weighted value per ton, air-dry:",74.39688715953308]
["Owned land"]
["Dryland"]
[null,null,null,null,"Business unit"]
["Income per acre",null,"Yield","Price","total"]
["Hay","1400 lb bales",4,56,224]
["Baleage or silage","bales",0,0,0]
{"$rows_left_out":1328}
{"sheet":"Prod(2021 Fesc-Clover Hay)","index":3,"n_rows":1337,"n_cols":7,"rows_kept":1337,"cut":false,"hidden":true,"merged":[]}
["Typical",null,null,null,"2020-10-26",null,""]
[]
["2021 Fesc-Clover Hay",null,null,"Yield, tons air-dry:",3.14]
["Production",null,null,"Weighted value per ton, air-dry:",90.764331210191074]
["Owned land"]
["Dryland"]
[null,null,null,null,"Business unit"]
["Income per acre",null,"Yield","Price","total"]
["Hay","tons",3,90,270]
["Baleage or silage","bales",0,0,0]
{"$rows_left_out":1328}
{"sheet":"Est(2021 CS Pasture Estab)","index":4,"n_rows":1337,"n_cols":7,"rows_kept":1337,"cut":false,"hidden":true,"merged":[]}
["Typical",null,null,null,"2020-10-13",null,""]
[]
["2021 CS Pasture Estab",null,null,"Yield, tons air-dry:",0.82499999999999996]
["Establishment year",null,null,"Weighted value per ton, air-dry:",36.363636363636367]
["Owned land"]
["Dryland"]
[null,null,null,null,"Business unit"]
["Income per acre",null,"Yield","Price","total"]
["Hay"," lb bales",0,0,0]
["Baleage or silage","tons",0,0,0]
{"$rows_left_out":1328}
{"sheet":"Prod(2021 Alfalfa Baleage)","index":5,"n_rows":1337,"n_cols":7,"rows_kept":1337,"cut":false,"hidden":true,"merged":[]}
["Typical",null,null,null,"2020-10-26",null,""]
[]
["2021 Alfalfa Baleage",null,null,"Yield, tons air-dry:",5]
["Production",null,null,"Weighted value per ton, air-dry:",162]
["Owned land"]
["Dryland"]
[null,null,null,null,"Business unit"]
["Income per acre",null,"Yield","Price","total"]
["Hay"," lb bales",0,0,0]
["Baleage or silage","tons",9,90,810]
{"$rows_left_out":1328}
{"sheet":"Prod(2021 Alfalfa Small Bal...)","index":6,"n_rows":1337,"n_cols":7,"rows_kept":1337,"cut":false,"hidden":true,"merged":[]}
["Typical",null,null,null,"2020-10-26",null,""]
[]
["2021 Alfalfa Small Bales",null,null,"Yield, tons air-dry:",5.0000999999999998]
["Production",null,null,"Weighted value per ton, air-dry:",200]
["Owned land"]
["Dryland"]
[null,null,null,null,"Business unit"]
["Income per acre",null,"Yield","Price","total"]
["Hay","60 lb bales",166.67,6,1000.02]
["Baleage or silage","bales",0,0,0]
{"$rows_left_out":1328}
{"sheet":"Est(2021 Alfalfa Estab)","index":7,"n_rows":1337,"n_cols":7,"rows_kept":1337,"cut":false,"hidden":true,"merged":[]}
["Typical",null,null,null,"2020-10-26",null,""]
[]
["2021 Alfalfa Estab",null,null,"Yield, tons air-dry:",2.1]
["Establishment year",null,null,"Weighted value per ton, air-dry:",200]
["Owned land"]
["Dryland"]
[null,null,null,null,"Business unit"]
["Income per acre",null,"Yield","Price","total"]
["Hay","60 lb bales",70,6,420]
["Baleage or silage","tons",0,0,0]
{"$rows_left_out":1328}
{"sheet":"Est(2021 Corn Silage)","index":8,"n_rows":1337,"n_cols":7,"rows_kept":1337,"cut":false,"hidden":true,"merged":[]}
["Typical",null,null,null,"2020-10-26",null,""]
[]
["2021 Corn Silage",null,null,"Yield, tons air-dry:",8]
["Establishment year",null,null,"Weighted value per ton, air-dry:",101.25]
["Owned land"]
["Dryland"]
[null,null,null,null,"Business unit"]
["Income per acre",null,"Yield","Price","total"]
["Hay","tons",0,0,0]
["Baleage or silage","tons",18,45,810]
{"$rows_left_out":1328}
{"sheet":"MDB","index":9,"n_rows":180,"n_cols":45,"rows_kept":180,"cut":false,"hidden":true,"merged":[]}
["Tractors Data",null,null,null,null,null,null,"Tractors Used"]
[null,null,null,null,"Overhead",null,null,null,null,null,"Overhead"]
["Use","HP","Maint. & Repair Cost/Hr","Depreciation Cost/Hr","Cost/Hr","Diesel Hr/Gal","Year for data","HP","Maint. & Repair Cost/Hr","Depreciation Cost/Hr","Cost/Hr","Diesel Hr/Gal",null,null,"Number of Columns"]
[false,"40 HP",0.6048,2.6286551813260108,2.6145101516921936,1.76,null,"60 HP",1.1100000000000001,4.07,3.12,2.6399999999999997,null,null,5]
[true,"60 HP",1.1100000000000001,4.07,3.12,2.6399999999999997,2020,"105 MFWD",4.05,16.829999999999998,10.28,4.62]
[false,"75 HP",1.87,6.3,4.97,3.3,2020,0]
[false,"105 TWD",3.5559216000000009,11.945780495351976,11.817113161009503,4.84]
[false,"140 TWD",3.9798897600000003,16.590113129546094,16.827497597912256,6.1599999999999993]
[true,"105 MFWD",4.05,16.829999999999998,10.28,4.62,2020]
[false,"130 MFWD",5.04,20.95,12.74,5.72,2020]
{"$rows_left_out":171}
{"sheet":"Machinery Cost","index":10,"n_rows":72,"n_cols":23,"rows_kept":72,"cut":false,"hidden":true,"merged":[[3,18,3,20],[3,15,3,17],[3,11,3,14],[3,8,3,10]]}
[null,"Skilled Labor, $/hr",{"$f":"Input!B71","v":21}]
[null,"Unskilled Labor, $/hr",{"$f":"Input!B70","v":15.5}]
[null,"Power Unit Fuel",{"$f":"Input!B90","v":2.38}]
[null,"Pickup fuel, $/gal",{"$f":"Input!B91","v":2.5499999999999998},null,null,null,null,null,"Activity Costs",null,null,"Labor and Fuel, Quantity and Costs",null,null,null,"Machine Costs",null,null,"Power Costs"]
[null,null,null,null,null,null,null,"Passes","Total","Operating","Ownership","Acres per","Fuel ","Labor","Fuel ","Rep & Main","Depreciation","Overhead","Rep and Main","Depreciation","Overhead"]
["Name","Implement","Power","ID","Implement","Power Source","Use","Trips/Acre","$/Acre","$/Acre","$/Acre","Labor Hour","Gal/Acre","$/Acre","$/Acre","$/Acre","$/Acre","$/Acre","$/Acre","$/Acre","$/Acre","Rented","Label"]
["Chisel_Plow",{"$f":"Input!B154","v":"15 ft"},{"$f":"Input!D154","v":0},1,{"$f":"VLOOKUP($B7,OFFSET(INDIRECT(A7),0,0,,MDB!$H$33),2,FALSE)","v":"Chisel plow (15 ft)"},{"$f":"VLOOKUP(C7,OFFSET(Power_Size,0,0,,MDB!$O$4),1,FALSE)","v":{"$error":"#N/A"}},{"$f":"IF(H7>0,1,0)","v":0},{"$f":"Input!F154","v":0},{"$f":"J7+K7","v":7.4651746442432083},{"$f":"N7+O7+P7+S7+Input!H154","v":2.7851746442432086},{"$f":"Q7+R7+T7+U7","v":4.68},{"$f":"VLOOKUP($B7,OFFSET(INDIRECT(A7),0,0,,MDB!$H$33),3,FALSE)","v":7.73},{"$f":"VLOOKUP(C7,OFFSET(Power_Size,0,0,ROWS(Power_Size)+1,MDB!$O$4),5,FALSE)/L7","v":0},{"$f":"C$2*(1/L7)","v":2.0051746442432083},{"$f":"M7*C$3","v":0},{"$f":"IF(V7=0,VLOOKUP($B7,OFFSET(INDIRECT(A7),0,0,,MDB!$H$33),4,FALSE),0)","v":0.78},{"$f":"IF(V7=0,VLOOKUP($B7,OFFSET(INDIRECT(A7),0,0,,MDB!$H$33),5,FALSE),0)","v":2.73},{"$f":"IF(V7=0,VLOOKUP($B7,OFFSET(INDIRECT(A7),0,0,,MDB!$H$33),6,FALSE),0)","v":1.95},{"$f":"(VLOOKUP(C7,OFFSET(Power_Size,0,0,ROWS(Power_Size)+1,MDB!$O$4),2,FALSE)/L7)+(0.15*O7)","v":0},{"$f":"VLOOKUP(C7,OFFSET(Power_Size,0,0,ROWS(Power_Size)+1,MDB!$O$4),3,FALSE)/L7","v":0},{"$f":"VLOOKUP(C7,OFFSET(Power_Size,0,0,ROWS(Power_Size)+1,MDB!$O$4),4,FALSE)/L7","v":0},{"$f":"Input!H154","v":0},{"$f":"CONCATENATE(IF(V7<>0,\"Rent, \",\"\"),E7,\"; \",F7)","v":{"$error":"#N/A"}}]
["Chisel_Plow_FD",{"$f":"Input!B155","v":"16.3 ft"},{"$f":"Input!D155","v":0},2,{"$f":"VLOOKUP($B8,OFFSET(INDIRECT(A8),0,0,,MDB!$H$33),2,FALSE)","v":"Chisel plow, front dsk (16.3 ft)"},{"$f":"VLOOKUP(C8,OFFSET(Power_Size,0,0,,MDB!$O$4),1,FALSE)","v":{"$error":"#N/A"}},{"$f":"IF(H8>0,1,0)","v":0},{"$f":"Input!F155","v":0},{"$f":"J8+K8","v":5.4548155314271076},{"$f":"N8+O8+P8+S8+Input!H155","v":2.1011883709733321},3.3536271604537755,{"$f":"VLOOKUP($B8,OFFSET(INDIRECT(A8),0,0,,MDB!$H$33),3,FALSE)","v":9.2083333333333339},{"$f":"VLOOKUP(C8,OFFSET(Power_Size,0,0,ROWS(Power_Size)+1,MDB!$O$4),5,FALSE)/L8","v":0},{"$f":"C$2*(1/L8)","v":1.683257918552036},0,{"$f":"IF(V8=0,VLOOKUP($B8,OFFSET(INDIRECT(A8),0,0,,MDB!$H$33),4,FALSE),0)","v":0.41793045242129601},{"$f":"IF(V8=0,VLOOKUP($B8,OFFSET(INDIRECT(A8),0,0,,MDB!$H$33),5,FALSE),0)","v":1.7728469850317514},{"$f":"IF(V8=0,VLOOKUP($B8,OFFSET(INDIRECT(A8),0,0,,MDB!$H$33),6,FALSE),0)","v":1.5807801754220241},{"$f":"(VLOOKUP(C8,OFFSET(Power_Size,0,0,ROWS(Power_Size)+1,MDB!$O$4),2,FALSE)/L8)+(0.15*O8)","v":0},{"$f":"VLOOKUP(C8,OFFSET(Power_Size,0,0,ROWS(Power_Size)+1,MDB!$O$4),3,FALSE)/L8","v":0},{"$f":"VLOOKUP(C8,OFFSET(Power_Size,0,0,ROWS(Power_Size)+1,MDB!$O$4),4,FALSE)/L8","v":0},{"$f":"Input!H155","v":0},{"$f":"CONCATENATE(IF(V8<>0,\"Rent, \",\"\"),E8,\"; \",F8)","v":{"$error":"#N/A"}}]
["Moldboard_Plow",{"$f":"Input!B156","v":"6 ft"},{"$f":"Input!D156","v":0},3,{"$f":"VLOOKUP($B9,OFFSET(INDIRECT(A9),0,0,,MDB!$H$33),2,FALSE)","v":"Moldboard plow 4 bottom-18 (6 ft)"},{"$f":"VLOOKUP(C9,OFFSET(Power_Size,0,0,,MDB!$O$4),1,FALSE)","v":{"$error":"#N/A"}},0,{"$f":"Input!F156","v":0},{"$f":"J9+K9","v":13.663093407321618},{"$f":"N9+O9+P9+S9+Input!H156","v":7.9892470900096448},5.6738463173119733,{"$f":"VLOOKUP($B9,OFFSET(INDIRECT(A9),0,0,,MDB!$H$33),3,FALSE)","v":2.7818181818181817},{"$f":"VLOOKUP(C9,OFFSET(Power_Size,0,0,ROWS(Power_Size)+1,MDB!$O$4),5,FALSE)/L9","v":0},{"$f":"C$2*(1/L9)","v":5.5718954248366011},0,{"$f":"IF(V9=0,VLOOKUP($B9,OFFSET(INDIRECT(A9),0,0,,MDB!$H$33),4,FALSE),0)","v":2.4173516651730433},{"$f":"IF(V9=0,VLOOKUP($B9,OFFSET(INDIRECT(A9),0,0,,MDB!$H$33),5,FALSE),0)","v":3.0802799417580218},{"$f":"IF(V9=0,VLOOKUP($B9,OFFSET(INDIRECT(A9),0,0,,MDB!$H$33),6,FALSE),0)","v":2.5935663755539511},{"$f":"(VLOOKUP(C9,OFFSET(Power_Size,0,0,ROWS(Power_Size)+1,MDB!$O$4),2,FALSE)/L9)+(0.15*O9)","v":0},{"$f":"VLOOKUP(C9,OFFSET(Power_Size,0,0,ROWS(Power_Size)+1,MDB!$O$4),3,FALSE)/L9","v":0},{"$f":"VLOOKUP(C9,OFFSET(Power_Size,0,0,ROWS(Power_Size)+1,MDB!$O$4),4,FALSE)/L9","v":0},{"$f":"Input!H156","v":0},{"$error":"#N/A"}]
["Field_Cultivator",{"$f":"Input!B157","v":"18 ft"},{"$f":"Input!D157","v":0},4,{"$f":"VLOOKUP($B10,OFFSET(INDIRECT(A10),0,0,,MDB!$H$33),2,FALSE)","v":"Field cultivator (18 ft)"},{"$f":"VLOOKUP(C10,OFFSET(Power_Size,0,0,,MDB!$O$4),1,FALSE)","v":{"$error":"#N/A"}},0,{"$f":"Input!F157","v":0},3.5127827180724411,{"$f":"N10+O10+P10+S10+Input!H157","v":1.7739775910364144},1.738805127036027,{"$f":"VLOOKUP($B10,OFFSET(INDIRECT(A10),0,0,,MDB!$H$33),3,FALSE)","v":12.981818181818182},{"$f":"VLOOKUP(C10,OFFSET(Power_Size,0,0,ROWS(Power_Size)+1,MDB!$O$4),5,FALSE)/L10","v":0},{"$f":"(1/L10)*C$2","v":1.1939775910364143},0,{"$f":"IF(V10=0,VLOOKUP($B10,OFFSET(INDIRECT(A10),0,0,,MDB!$H$33),4,FALSE),0)","v":0.57999999999999996},{"$f":"IF(V10=0,VLOOKUP($B10,OFFSET(INDIRECT(A10),0,0,,MDB!$H$33),5,FALSE),0)","v":1.03},{"$f":"IF(V10=0,VLOOKUP($B10,OFFSET(INDIRECT(A10),0,0,,MDB!$H$33),6,FALSE),0)","v":0.70880512703602694},{"$f":"(VLOOKUP(C10,OFFSET(Power_Size,0,0,ROWS(Power_Size)+1,MDB!$O$4),2,FALSE)/L10)+(0.15*O10)","v":0},{"$f":"VLOOKUP(C10,OFFSET(Power_Size,0,0,ROWS(Power_Size)+1,MDB!$O$4),3,FALSE)/L10","v":0},{"$f":"VLOOKUP(C10,OFFSET(Power_Size,0,0,ROWS(Power_Size)+1,MDB!$O$4),4,FALSE)/L10","v":0},{"$f":"Input!H157","v":0},{"$error":"#N/A"}]
{"$rows_left_out":63}
{"sheet":"Output","index":11,"n_rows":117,"n_cols":16,"rows_kept":117,"cut":false,"hidden":true,"merged":[]}
[null,"Enterprise Budget",null,null,null,{"$f":"IF(MDB!$C$177=1,TODAY(),\"\")","v":"2020-10-26"},null,{"$f":"IF(MDB!$C$177=2,TODAY(),\"\")","v":""},null,null,null,null,null,null,"Enterprise Budget"]
[null,null,null,null,null,null,null,null,null,null,"tons hay/acre"]
[null,{"$f":"Input!B5","v":"2021 Fescue+Seed+Stubble Prod"},null,null,"Yield, tons air-dry:",{"$f":"K3","v":3.2124999999999999},null,null,null,null,{"$f":"SUM(K7:M7)","v":3.2124999999999999},null,null,null,"Yield per acre, tons air-dry basis*"]
[null,{"$f":"VLOOKUP(MDB!C173,MDB!H172:J173,3)","v":"Production"},null,null,{"$f":"IF(F4<>\"\",\"Weighted value per ton, air-dry:\",\"\")","v":"Weighted value per ton, air-dry:"},{"$f":"IF(SUM(K7:M7)<>0,SUM(K8:M8)/SUM(K7:M7),\"\")","v":74.39688715953308},null,null,null,null,null,null,null,null,"Weighted value per ton, air dry*"]
[null,{"$f":"IF(MDB!C177=1,IF(Input!B81<>0,\"Cash rent\",\"Owned land\"),\"Share rent\")","v":"Owned land"},null,null,null,null,null,null,null,null,"hay","haylage","pasture"]
[null,{"$f":"VLOOKUP(MDB!C176,MDB!H179:I180,2)","v":"Dryland"}]
[null,null,null,null,null,"Business unit","Operator","Landlord",null,"Yield, DM",{"$f":"IF(MDB!$C$175=1,hay,(hay*Input!$B$17)/2000)","v":2.8},{"$f":"IF(MDB!$D$175=1,haylage*Input!B19/0.9,(haylage*Input!$B$19)/2000)","v":0},{"$f":"IF(MDB!$E$175=1,pasture,(pasture*Input!$B$21)/2000)","v":0.41249999999999998},null,"Income per acre"]
[null,"Income per acre",null,"Yield","Price","total","share","share",null,"Value",{"$f":"hay*Input!F16","v":224},{"$f":"haylage*Input!F18","v":0},{"$f":"pasture*Input!F20","v":15},null,"Hay",40]
[null,"Hay",{"$f":"IF(HayYieldType=2,Input!B17 & \" lb \",\"\")  & VLOOKUP(MDB!$C$175,OFFSET(Primary_Units,,-1,,3),3) & \"s\"","v":"1400 lb bales"},{"$f":"hay","v":4},{"$f":"Input!F16","v":56},{"$f":"D9*E9","v":224},{"$f":"0.01*(100-Input!$B$134)*Output!$F9","v":224},{"$f":"0.01*(Input!$B$134)*Output!$F9","v":0},null,"Value/Yield",{"$f":"K8/K7","v":80},{"$f":"L8/L7","v":{"$error":"#DIV/0!"}},{"$f":"M8/M7","v":36.363636363636367},null,"Baleage",0]
[null,"Baleage or silage",{"$f":"VLOOKUP(MDB!$D$175,OFFSET(Primary_Units,,-1,,3),3) & \"s\"","v":"bales"},{"$f":"haylage","v":0},{"$f":"Input!F18","v":0},{"$f":"D10*E10","v":0},{"$f":"0.01*(100-Input!$B$134)*Output!$F10","v":0},{"$f":"0.01*(Input!$B$134)*Output!$F10","v":0},null,null,null,null,null,null,"Grazing",14]
{"$rows_left_out":108}
{"sheet":"Store","index":12,"n_rows":340,"n_cols":9,"rows_kept":340,"cut":false,"hidden":true,"merged":[[1,1,1,2],[1,7,1,8],[1,4,1,5]]}
[]
[null,"Export",null,null,"Imported Data",null,null,"Lookup Data"]
[null,"establishment-82506",{"$f":"establishment","v":2},null,"establishment-82506",2,null,{"$f":"B3","v":"establishment-82506"},{"$f":"IF(COUNTIF(import,\"=\"&H3)<>0,IF(VLOOKUP(H3,import,2,FALSE)<>0,VLOOKUP(H3,import,2,FALSE),\"\"),\"\")","v":2}]
[null,"harvestashay-82506",{"$f":"HarvAsHay","v":true},null,"harvestashay-82506",true,null,{"$f":"B4","v":"harvestashay-82506"},true]
[null,"harvestashaylage-82506",{"$f":"HarvAsHaylage","v":false},null,"harvestashaylage-82506",false,null,"harvestashaylage-82506",false]
[null,"harvestaspasture-82506",{"$f":"HarvAsPasture","v":true},null,"harvestaspasture-82506",true,null,"harvestaspasture-82506",true]
[null,"harvestasseed-82506",{"$f":"HarvAsSeed","v":true},null,"harvestasseed-82506",true,null,"harvestasseed-82506",true]
[null,"yield-1-83106",{"$f":"HayYieldType","v":2},null,"yield-1-83106",2,null,"yield-1-83106",2]
[null,"yield-2-83106",{"$f":"HaylageYieldType","v":2},null,"yield-2-83106",2,null,"yield-2-83106",2]
[null,"yield-3-83106",{"$f":"PastureYieldType","v":2},null,"yield-3-83106",2,null,"yield-3-83106",2]
{"$rows_left_out":330}