{"text_format":"1","workbook":"xlsx","n_sheets":12,"sheets":["Instructions","Input","Irrigated Corn 2022","Double crop soybeans 2022","Soybeans 2022","Dryland Corn 2022","Wheat 2022","Grain Sorghum 2022","Output","Machinery Cost","MDB","Store"],"not_rendered":{"charts":0,"images":1,"macros":1,"external_links":0,"defined_names":123,"comments":3,"pivot_tables":0},"unopened":[],"bounds":{"document_bytes":16777216,"sheet_cells":100000,"rows_first":2000,"rows_last":500,"rows_between":2000,"halvings":0,"cell_chars":16384,"cell_head_chars":4096},"cells_cut":0,"cells_raw":0,"read":"whole","date_system":"1900"}

{"sheet":"Instructions","index":0,"n_rows":42,"n_cols":5,"rows_kept":42,"cut":false,"hidden":true,"merged":[]}
["Barter","See owned equipment"]
["Budget Report","Selecting the 'Budget Report' button initiates the calculations to build a budget report. After a few seconds (depending on computer speed), the report appears on screen. It is stored as a new worksheet in the current session.\n\nIt can be renamed (see renaming worksheets)\nIt can be recalled from the 'Custom Budget' list with the 'Recall Data' command.\nIt can be hidden with Excel commands (Format\\Sheet\\Hide). Hiding does not remove the report from the 'Custom Budgets' list.\nIt can be  permanently deleted. To delete, point to the worksheet tab, right-click and select delete."]
["Business overhead costs","Use these fields to estimate total overhead costs for the farm and then allocate the portion of the total to the enterprise as a percent. Overhead costs for the enterprise are then divided by planted acres for the budget report.\n\nThe CBG estimates total operating and ownership costs of the pickup. Therefore, it is important to specify the allocation for the enterprise only as a percent of total use, farm and non-farm.","overhead"]
["Button controls","See help for specific button topics, such as, 'Clear Input'. All button controls are accessible from the Input worksheet."]
["Clear input","This button clears all previously entered data in the input worksheet in preparation for entering a new set of data. A warning is issued prior to clearing the input. Input data can be retrieved with the 'Recall Data' button only if it has been associated with a budget report via the 'Budget Report' command.\n\nTIP: If the objective is to make minor changes in an existing budget of the same crop, do not use 'Clear Input'. Rather, recall the previous budget with 'Recall Data', make the minor data changes in the input worksheet and give the budget a new description in the 'Crop description' field. Press 'Budget Report' to make new calculations and store a new budget based on the revised data. "]
["Combines","See owned equipment"]
["Copy budget","The CBG works like any Excel spreadsheet. To copy a budget report to a new file, select the area to be copied and use the Edit\\Copy\\Paste or Paste Special commands to place the report in a new worksheet or a new file."]
["Crop description","The crop description field is critical for identifying budgets to be saved in the CBG and distinguishing between budgets of the same crop. The generator will not allow a budget with the same crop description to be overwritten without warning the user.\n\nTIP: Use the crop description as a note pad to identify specific characteristics of the crop. For example, 'High Yield' vs. 'Low Yield', or 'Custom Rates' vs. 'Operator Owned'.","description"]
["Crop identification","Entries in this section determine the input questions that will be presented. The crop description field is critical to building a unique budget report.\n\nBegin building a new budget by selecting a crop from the drop down list. This action clears all previous entries and builds an appropriate input list for the specified crop.\n\nAlternatively, if you are modifying an existing budget and wish to keep the bulk of the previous input data, do not change the crop selection. Instead, enter a unique description for the new budget in the crop description field. A separate budget worksheet is created for each unique description.\n\nFor example, you've already created a corn budget with a yield of 140 bushels and want to use most of the same inputs to build a budget for a yield of 160 bushels. Enter the description \"High yield\" make changes and rerun the budget by clicking on 'Budget Report'. The CBG will warn you before overwriting any input data.\n\nBe sure to select appropriate yield units and irrigation, if any. "]
["Crop returns","Enter appropriate price and yield information. The government payments field is optional.\n\nA method to budget with uncertain prices is to use the trigger price for counter-cyclical payments as a proxy for the market price. The government payments field can be used to enter only the fixed payment that is independent of yield and price.\n\nThe planted acres field is used in some of the calculations to estimate fixed costs of machinery.","receipts"]
{"$rows_left_out":33}
{"sheet":"Input","index":1,"n_rows":199,"n_cols":34,"rows_kept":199,"cut":false,"hidden":false,"merged":[[198,0,198,7],[27,1,27,5],[141,0,141,7],[58,1,58,5],[50,1,50,5],[127,0,127,7],[111,0,111,7],[1,0,1,7],[9,1,9,6],[19,0,19,7],[10,0,10,7],[3,0,3,7]]}
[]
["CROP BUDGET INPUT",null,null,null,null,null,null,null,null,null,null,null,null,null,null,null,null,null,null,null,null,null,null,null,null,null,"x","x","x","x","x","x","x","x"]
["Enter data in white boxes. Use \"Tab\" key to navigate between boxes.",null,null,null,null,null,null,"Version 11.7.16"]
["Crop Identification",null,null,null,null,null,null,null,null,null,null,null,null,null,null,null,null,null,null,null,null,null,null,null,null,null,"c","silage","g","s","w","ws","i","Mach#"]
["Crop selection"]
["Primary crop yield units"]
["By-product units"]
["Irrigation"]
["Lease arrangement"]
["Crop description","2022 Soybeans"]
{"$rows_left_out":190}
{"sheet":"Irrigated Corn 2022","index":2,"n_rows":1295,"n_cols":7,"rows_kept":1295,"cut":false,"hidden":true,"merged":[]}
["Typical",null,null,null,null,null,"2021-10-14"]
[]
["Corn, grain","2022 Irrigated"]
["Irrigated"]
["Owned land",null,null,null,null,"",""]
[null,null,null,null,"Business"]
["Income per acre","Units","Yield","Price","total"]
["Primary crop","bushels",215,4.5999999999999996,988.99999999999989]
["By product crop","bushels",0,0,0]
["Net payments (fixed)",null,null,null,0]
{"$rows_left_out":1286}
{"sheet":"Double crop soybeans 2022","index":3,"n_rows":1295,"n_cols":7,"rows_kept":1295,"cut":false,"hidden":true,"merged":[]}
["Typical",null,null,null,null,null,"2021-10-14"]
[]
["Soybeans, double crop","2022 Double Crop Beans"]
["Dryland"]
["Owned land",null,null,null,null,"",""]
[null,null,null,null,"Business"]
["Income per acre","Units","Yield","Price","total"]
["Primary crop","bushels",35,12.05,421.75]
["By product crop","bushels",0,0,0]
["Net payments (fixed)",null,null,null,0]
{"$rows_left_out":1286}
{"sheet":"Soybeans 2022","index":4,"n_rows":1295,"n_cols":7,"rows_kept":1295,"cut":false,"hidden":true,"merged":[]}
["Typical",null,null,null,null,null,"2021-10-14"]
[]
["Soybeans","2022 Soybeans"]
["Dryland"]
["Owned land",null,null,null,null,"",""]
[null,null,null,null,"Business"]
["Income per acre","Units","Yield","Price","total"]
["Primary crop","bushels",55,12.05,662.75]
["By product crop","bushels",0,0,0]
["Net payments (fixed)",null,null,null,0]
{"$rows_left_out":1286}
{"sheet":"Dryland Corn 2022","index":5,"n_rows":1295,"n_cols":7,"rows_kept":1295,"cut":false,"hidden":true,"merged":[]}
["Typical",null,null,null,null,null,"2021-10-14"]
[]
["Corn, grain","Dryland 2022"]
["Dryland"]
["Owned land",null,null,null,null,"",""]
[null,null,null,null,"Business"]
["Income per acre","Units","Yield","Price","total"]
["Primary crop","bushels",170,4.5999999999999996,781.99999999999989]
["By product crop","bushels",0,0,0]
["Net payments (fixed)",null,null,null,0]
{"$rows_left_out":1286}
{"sheet":"Wheat 2022","index":6,"n_rows":1295,"n_cols":7,"rows_kept":1295,"cut":false,"hidden":true,"merged":[]}
["Typical",null,null,null,null,null,"2021-10-14"]
[]
["Wheat","2022 Winter Wheat"]
["Dryland"]
["Owned land",null,null,null,null,"",""]
[null,null,null,null,"Business"]
["Income per acre","Units","Yield","Price","total"]
["Primary crop","bushels",70,6.5,455]
["By product crop","bushels",0,0,0]
["Net payments (fixed)",null,null,null,0]
{"$rows_left_out":1286}
{"sheet":"Grain Sorghum 2022","index":7,"n_rows":1295,"n_cols":7,"rows_kept":1295,"cut":false,"hidden":true,"merged":[]}
["Typical",null,null,null,null,null,"2021-10-14"]
[]
["Grain sorghum","Milo 2022"]
["Dryland"]
["Owned land",null,null,null,null,"",""]
[null,null,null,null,"Business"]
["Income per acre","Units","Yield","Price","total"]
["Primary crop","bushels",100,4.75,475]
["By product crop","bushels",0,0,0]
["Net payments (fixed)",null,null,null,0]
{"$rows_left_out":1286}
{"sheet":"Output","index":8,"n_rows":115,"n_cols":12,"rows_kept":115,"cut":false,"hidden":true,"merged":[]}
[null,"Enterprise Budget",null,null,null,null,null,{"$f":"TODAY()","v":"2021-10-25"},null,null,"Summary","Summary\n"]
[]
[null,{"$f":"VLOOKUP(MDB!C158,MDB!H157:J163,2)","v":"Soybeans"},{"$f":"Input!B10","v":"2022 Soybeans"},null,null,null,null,null,null,null,"Primary crop yield","Primary crop yield"]
[null,{"$f":"VLOOKUP(MDB!C161,MDB!F157:G158,2)","v":"Dryland"},null,null,null,null,null,null,null,null,"Price per unit","Price per unit"]
[null,{"$f":"VLOOKUP(leasenum,MDB!F160:G162,2)","v":"Owned land"},null,null,null,null,{"$f":"IF(B5=\"share lease\",(100-Input!$B$130)*0.01,\"\")","v":""},{"$f":"IF(B5=\"share lease\",Input!B130*0.01,\"\")","v":""},null,null,"Secondary crop yield","Secondary crop yield"]
[null,null,null,null,null,"Business","Operator","Landlord",null,null,"Price per unit","Price per unit"]
[null,"Income per acre","Units","Yield","Price","total","share","share",null,null,"",""]
[null,"Primary crop",{"$f":"VLOOKUP(MDB!$C$159,MDB!$K$157:$M$160,3) & \"s\"","v":"bushels"},{"$f":"Input!B13","v":55},{"$f":"Input!B14","v":12.05},{"$f":"D8*E8","v":662.75},{"$f":"0.01*(100-Input!$B$130)*$F$8","v":662.75},{"$f":"0.01*(Input!$B$130)*$F$8","v":0}]
[null,"By product crop",{"$f":"VLOOKUP(MDB!$C$160,MDB!$K$157:$M$160,3) & \"s\"","v":"bushels"},{"$f":"Input!B15","v":0},{"$f":"Input!B16","v":0},{"$f":"D9*E9","v":0},{"$f":"0.01*(100-Input!$B$130)*$F$9","v":0},{"$f":"0.01*(Input!$B$130)*$F$9","v":0},null,null,"Income per acre","Income per acre"]
[null,"Net payments (fixed)",null,null,null,{"$f":"Input!B17","v":0},{"$f":"0.01*(100-Input!$B$131)*$F$10","v":0},{"$f":"0.01*(Input!$B$131)*$F$10","v":0},null,null,"Primary crop","Primary crop"]
{"$rows_left_out":106}
{"sheet":"Machinery Cost","index":9,"n_rows":121,"n_cols":23,"rows_kept":121,"cut":false,"hidden":true,"merged":[[3,18,3,20],[3,15,3,17],[3,11,3,14],[3,8,3,10]]}
[null,"Skilled Labor, $/hr",{"$f":"Input!B65","v":23}]
[null,"Unskilled Labor, $/hr",{"$f":"Input!B64","v":17.5}]
[null,"Power Unit Fuel, $/gal",{"$f":"Input!B84","v":2.91}]
[null,"Pickup fuel, $/gal",{"$f":"Input!B85","v":3.08},null,null,null,null,null,"Activity Costs",null,null,"Labor and Fuel, Quantity and Costs",null,null,null,"Machine Costs",null,null,"Power Costs"]
[null,null,null,null,null,null,null,"Passes","Total","Operating","Ownership","Acres per","Fuel ","Labor","Fuel ","Rep & Main","Depreciation","Overhead","Rep and Main","Depreciation","Overhead"]
["Name","Implement","Power","ID","Implement","Power Source","Use","Trips/Acre","$/Acre","$/Acre","$/Acre","Labor Hour","Gal/Acre","$/Acre","$/Acre","$/Acre","$/Acre","$/Acre","$/Acre","$/Acre","$/Acre","Rented","Label"]
["Chisel_Plow",{"$f":"Input!B149","v":"15 ft"},{"$f":"Input!D149","v":0},1,{"$f":"VLOOKUP($B7,OFFSET(INDIRECT(A7),0,0,,MDB!$H$38),2,FALSE)","v":"Chisel plow (15 ft)"},{"$f":"VLOOKUP(C7,OFFSET(Power_Size,0,0,,MDB!$P$4),1,FALSE)","v":{"$error":"#N/A"}},{"$f":"IF(H7>0,1,0)","v":0},{"$f":"Input!F149","v":0},{"$f":"J7+K7","v":4.1761166360841466},{"$f":"N7+O7+P7+S7+V7","v":2.6745689630455818},{"$f":"Q7*H7+R7+T7*H7+U7","v":1.5015476730385651},{"$f":"VLOOKUP($B7,OFFSET(INDIRECT(A7),0,0,,MDB!$H$38),3,FALSE)","v":8.5},{"$f":"VLOOKUP(C7,OFFSET(Power_Size,0,0,ROWS(Power_Size)+1,MDB!$P$4),5,FALSE)/L7","v":0},{"$f":"C$2*(1/L7)","v":2.0588235294117645},{"$f":"M7*C$3","v":0},{"$f":"IF(V7=0,VLOOKUP($B7,OFFSET(INDIRECT(A7),0,0,,MDB!$H$38),4,FALSE),0)","v":0.61574543363381717},{"$f":"IF(V7=0,VLOOKUP($B7,OFFSET(INDIRECT(A7),0,0,,MDB!$H$38),5,FALSE),0)","v":1.6586863837228891},{"$f":"IF(V7=0,VLOOKUP($B7,OFFSET(INDIRECT(A7),0,0,,MDB!$H$38),6,FALSE),0)","v":1.5015476730385651},{"$f":"(VLOOKUP(C7,OFFSET(Power_Size,0,0,ROWS(Power_Size)+1,MDB!$P$4),2,FALSE)/L7)+(0.15*O7)","v":0},{"$f":"VLOOKUP(C7,OFFSET(Power_Size,0,0,ROWS(Power_Size)+1,MDB!$P$4),3,FALSE)/L7","v":0},{"$f":"VLOOKUP(C7,OFFSET(Power_Size,0,0,ROWS(Power_Size)+1,MDB!$P$4),4,FALSE)/L7","v":0},{"$f":"Input!H149","v":0},{"$f":"CONCATENATE(IF(V7<>0,\"Rent, \",\"\"),E7,\"; \",C7)","v":"Chisel plow (15 ft); 0"}]
["Chisel_Plow_FD",{"$f":"Input!B150","v":"16.3 ft"},{"$f":"Input!D150","v":0},2,{"$f":"VLOOKUP($B8,OFFSET(INDIRECT(A8),0,0,,MDB!$H$38),2,FALSE)","v":"Chisel plow, front dsk (16.3 ft)"},{"$f":"VLOOKUP(C8,OFFSET(Power_Size,0,0,,MDB!$P$4),1,FALSE)","v":{"$error":"#N/A"}},{"$f":"IF(H8>0,1,0)","v":0},{"$f":"Input!F150","v":0},{"$f":"J8+K8","v":3.8991631165311027},{"$f":"N8+O8+P8+S8+V8","v":2.3183829411090788},{"$f":"Q8*H8+R8+T8*H8+U8","v":1.5807801754220241},{"$f":"VLOOKUP($B8,OFFSET(INDIRECT(A8),0,0,,MDB!$H$38),3,FALSE)","v":9.2083333333333339},{"$f":"VLOOKUP(C8,OFFSET(Power_Size,0,0,ROWS(Power_Size)+1,MDB!$P$4),5,FALSE)/L8","v":0},{"$f":"C$2*(1/L8)","v":1.9004524886877827},0,{"$f":"IF(V8=0,VLOOKUP($B8,OFFSET(INDIRECT(A8),0,0,,MDB!$H$38),4,FALSE),0)","v":0.41793045242129601},{"$f":"IF(V8=0,VLOOKUP($B8,OFFSET(INDIRECT(A8),0,0,,MDB!$H$38),5,FALSE),0)","v":1.7728469850317514},{"$f":"IF(V8=0,VLOOKUP($B8,OFFSET(INDIRECT(A8),0,0,,MDB!$H$38),6,FALSE),0)","v":1.5807801754220241},{"$f":"(VLOOKUP(C8,OFFSET(Power_Size,0,0,ROWS(Power_Size)+1,MDB!$P$4),2,FALSE)/L8)+(0.15*O8)","v":0},{"$f":"VLOOKUP(C8,OFFSET(Power_Size,0,0,ROWS(Power_Size)+1,MDB!$P$4),3,FALSE)/L8","v":0},{"$f":"VLOOKUP(C8,OFFSET(Power_Size,0,0,ROWS(Power_Size)+1,MDB!$P$4),4,FALSE)/L8","v":0},{"$f":"Input!H150","v":0},{"$f":"CONCATENATE(IF(V8<>0,\"Rent, \",\"\"),E8,\"; \",C8)","v":"Chisel plow, front dsk (16.3 ft); 0"}]
["Moldboard_Plow",{"$f":"Input!B151","v":"6 ft"},{"$f":"Input!D151","v":0},3,{"$f":"VLOOKUP($B9,OFFSET(INDIRECT(A9),0,0,,MDB!$H$38),2,FALSE)","v":"Moldboard plow 4 bottom-18 (6 ft)"},{"$f":"VLOOKUP(C9,OFFSET(Power_Size,0,0,,MDB!$P$4),1,FALSE)","v":{"$error":"#N/A"}},0,{"$f":"Input!F151","v":0},{"$f":"J9+K9","v":11.301767713929609},8.7082013383756571,2.5935663755539511,{"$f":"VLOOKUP($B9,OFFSET(INDIRECT(A9),0,0,,MDB!$H$38),3,FALSE)","v":2.7818181818181817},{"$f":"VLOOKUP(C9,OFFSET(Power_Size,0,0,ROWS(Power_Size)+1,MDB!$P$4),5,FALSE)/L9","v":0},{"$f":"C$2*(1/L9)","v":6.2908496732026142},0,{"$f":"IF(V9=0,VLOOKUP($B9,OFFSET(INDIRECT(A9),0,0,,MDB!$H$38),4,FALSE),0)","v":2.4173516651730433},{"$f":"IF(V9=0,VLOOKUP($B9,OFFSET(INDIRECT(A9),0,0,,MDB!$H$38),5,FALSE),0)","v":3.0802799417580218},{"$f":"IF(V9=0,VLOOKUP($B9,OFFSET(INDIRECT(A9),0,0,,MDB!$H$38),6,FALSE),0)","v":2.5935663755539511},{"$f":"(VLOOKUP(C9,OFFSET(Power_Size,0,0,ROWS(Power_Size)+1,MDB!$P$4),2,FALSE)/L9)+(0.15*O9)","v":0},{"$f":"VLOOKUP(C9,OFFSET(Power_Size,0,0,ROWS(Power_Size)+1,MDB!$P$4),3,FALSE)/L9","v":0},{"$f":"VLOOKUP(C9,OFFSET(Power_Size,0,0,ROWS(Power_Size)+1,MDB!$P$4),4,FALSE)/L9","v":0},{"$f":"Input!H151","v":0},"Moldboard plow 4 bottom-18 (6 ft); 0"]
["Field_Cultivator",{"$f":"Input!B152","v":"35 ft"},{"$f":"Input!D152","v":0},4,{"$f":"VLOOKUP($B10,OFFSET(INDIRECT(A10),0,0,,MDB!$H$38),2,FALSE)","v":"Field cultivator (35 ft)"},{"$f":"VLOOKUP(C10,OFFSET(Power_Size,0,0,,MDB!$P$4),1,FALSE)","v":{"$error":"#N/A"}},0,{"$f":"Input!F152","v":0},2.0514717677943914,1.2955241386562288,0.75594762913816249,{"$f":"VLOOKUP($B10,OFFSET(INDIRECT(A10),0,0,,MDB!$H$38),3,FALSE)","v":25.242424242424242},{"$f":"VLOOKUP(C10,OFFSET(Power_Size,0,0,ROWS(Power_Size)+1,MDB!$P$4),5,FALSE)/L10","v":0},{"$f":"(1/L10)*C$2","v":0.69327731092436973},0,{"$f":"IF(V10=0,VLOOKUP($B10,OFFSET(INDIRECT(A10),0,0,,MDB!$H$38),4,FALSE),0)","v":0.60224682773185911},{"$f":"IF(V10=0,VLOOKUP($B10,OFFSET(INDIRECT(A10),0,0,,MDB!$H$38),5,FALSE),0)","v":0.81980697442244133},{"$f":"IF(V10=0,VLOOKUP($B10,OFFSET(INDIRECT(A10),0,0,,MDB!$H$38),6,FALSE),0)","v":0.75594762913816249},{"$f":"(VLOOKUP(C10,OFFSET(Power_Size,0,0,ROWS(Power_Size)+1,MDB!$P$4),2,FALSE)/L10)+(0.15*O10)","v":0},{"$f":"VLOOKUP(C10,OFFSET(Power_Size,0,0,ROWS(Power_Size)+1,MDB!$P$4),3,FALSE)/L10","v":0},{"$f":"VLOOKUP(C10,OFFSET(Power_Size,0,0,ROWS(Power_Size)+1,MDB!$P$4),4,FALSE)/L10","v":0},{"$f":"Input!H152","v":0},"Field cultivator (35 ft); 0"]
{"$rows_left_out":112}
{"sheet":"MDB","index":10,"n_rows":172,"n_cols":25,"rows_kept":172,"cut":false,"hidden":true,"merged":[]}
["Tractors Data",null,null,null,null,null,null,"Tractors Used"]
[null,null,null,null,"Overhead",null,null,null,null,null,"Overhead"]
["Use","HP","Maint. & Repair Cost/Hr","Depreciation Cost/Hr","Cost/Hr","Diesel Hr/Gal","Year for costs","HP","Maint. & Repair Cost/Hr","Depreciation Cost/Hr","Cost/Hr","Diesel Hr/Gal",null,null,null,"Number of Columns"]
[null,"40 HP",0.6048,2.3896865284781916,2.6145101516921936,1.76,null,"130 MFWD",5.28,19.739999999999998,13.98,5.72,null,null,null,5,null,null,null,{"$f":"D4*1.1","v":2.6286551813260108},{"$f":"E4*1.1","v":2.8759611668614133}]
[null,"60 HP",0.87360000000000004,3.4517694300240551,3.7367924413331681,2.6399999999999997,null,"225 MFWD",6.75,41.35,20.13,9.8999999999999986,null,null,null,null,null,null,null,{"$f":"D5*1.1","v":3.796946373026461},4.1104716854664849]
[null,"75 HP",1.3104,5.1776541450360822,5.5488136619997519,3.3,null,"360 4WD",5.92,51.51,31.6,15.84,null,null,null,null,null,null,null,5.6954195595396913,6.103695028199728]
[null,"110 TWD",3.5559216000000009,10.859800450319977,11.817113161009503,4.84,null,0,null,null,null,null,null,null,null,null,null,null,null,11.945780495351976,12.998824477110455]
[null,"140 TWD",3.9798897600000003,15.081921026860083,16.827497597912256,6.1599999999999993,null,null,null,null,null,null,null,null,null,null,null,null,null,16.590113129546094,18.510247357703484]
[null,"105 MFWD",2.16,9.2353095078833007,10.072639467555399,4.62,null,null,null,null,null,null,null,null,null,null,null,null,null,10.158840458671632,11.079903414310941]
[true,"130 MFWD",5.28,19.739999999999998,13.98,5.72,2021,null,null,null,null,null,null,null,null,null,null,null,null,21.713999999999999,15.378000000000002]
{"$rows_left_out":163}
{"sheet":"Store","index":11,"n_rows":298,"n_cols":9,"rows_kept":298,"cut":false,"hidden":true,"merged":[[1,1,1,2],[1,7,1,8]]}
[]
[null,"Export",null,null,"Imported Data",null,null,"Lookup Data"]
[null,"cropnum-22706",{"$f":"cropnum","v":4},null,"cropnum-22706",4,null,{"$f":"B3","v":"cropnum-22706"},{"$f":"IF(COUNTIF(import,\"=\"&H3)<>0,IF(VLOOKUP(H3,import,2,FALSE)<>0,VLOOKUP(H3,import,2,FALSE),\"\"),\"\")","v":4}]
[null,"primyieldtype-22706",{"$f":"primyield","v":1},null,"primyieldtype-22706",1,null,{"$f":"B4","v":"primyieldtype-22706"},1]
[null,"byyieldtype-22706",{"$f":"byyield","v":1},null,"byyieldtype-22706",1,null,"byyieldtype-22706",1]
[null,"irrigation2-22706",{"$f":"irrigation2","v":2},null,"irrigation2-22706",2,null,"irrigation2-22706",2]
[null,"leasenum-22706",{"$f":"leasenum","v":1},null,"leasenum-22706",1,null,"leasenum-22706",1]
[1,"40hp-22706",{"$f":"MDB!A4","v":0},null,"40hp-22706",0,null,"40hp-22706",""]
[null,"60hp-22706",{"$f":"MDB!A5","v":0},null,"60hp-22706",0,null,"60hp-22706",""]
[null,"75hp-22706",{"$f":"MDB!A6","v":0},null,"75hp-22706",0,null,"75hp-22706",""]
{"$rows_left_out":288}